{"text_format":"1","workbook":"xlsx","n_sheets":5,"sheets":["Time Set","Production","Med&Heavy","Bridge","#Mean Rates#"],"not_rendered":{"charts":0,"images":2,"macros":1,"external_links":0,"defined_names":2,"comments":0,"pivot_tables":0},"unopened":[],"bounds":{"document_bytes":16777216,"sheet_cells":100000,"rows_first":2000,"rows_last":500,"rows_between":2000,"halvings":0,"cell_chars":16384,"cell_head_chars":4096},"cells_cut":0,"cells_raw":0,"read":"whole","date_system":"1900"}

{"sheet":"Time Set","index":0,"n_rows":18,"n_cols":27,"rows_kept":18,"cut":false,"hidden":false,"merged":[[1,2,2,2],[10,2,11,2]]}
[null,null,null,null,null,null,null,null,null,null,null,null,null,null,null,null,null,null,null,null,null,null,null,null,null,null,{"$f":"DATE(YEAR(B5),1,1)","v":"2019-01-01"}]
["Contract","R-12345","Enter in the Contract, Amount (3) , Work Type (4), and NTP (5)",null,null,null,null,null,null,null,null,null,null,null,null,null,null,null,null,null,null,null,null,"Production",null,null,{"$f":"DATE(YEAR(AA1),MONTH(AA1)+1,1)","v":"2019-02-01"}]
["Original Amount",null,null,null,null,null,null,null,null,null,null,null,null,null,null,"Project Type","Contract Amount","Work Days","Type","Start Date","Completion Date (April)",null,null,"Regression",null,null,{"$f":"DATE(YEAR(AA2),MONTH(AA2)+1,1)","v":"2019-03-01"}]
["Type","Mill and Asphalt Resurface",null,{"$f":"VLOOKUP(B4,Table14[],4,TRUE)","v":"H"},null,null,null,null,null,null,null,null,null,null,null,"Asphalt Resurface",1000000,{"$f":"3*10^(-5)*$B$3+23.291","v":23.291},"H","2017-04-01",{"$f":"+WORKDAY(T4,R4)","v":"2017-05-03"},null,null,null,null,null,"2019-04-01"]
["NTP","2019-04-01",null,null,null,null,null,null,null,null,null,null,null,null,null,"Bridge Painting",1000000,{"$f":"0.0164*B3^0.7047","v":0},"B","2017-04-01","2017-04-01",null,null,null,null,null,"2019-05-01"]
[null,5,null,null,null,null,null,null,null,null,null,null,null,null,null,"Bridge Rehabilitation (Deck Replacement)",1000000,{"$f":"35.28*LN(B3)-360.64","v":{"$error":"#NUM!"}},"B","2017-04-01",{"$error":"#NUM!"},null,null,null,null,null,"2019-06-01"]
["Method","Regression",null,null,null,null,null,null,null,null,null,null,null,null,null,"Bridge Rehabilitation (Superstructure Repair)",1000000,{"$f":"26.67*LN(B3)-259.2","v":{"$error":"#NUM!"}},"B","2017-04-01",{"$error":"#NUM!"},null,null,null,null,null,"2019-07-01"]
["Work Days",{"$f":"IF(B3=\"\",\"\",VLOOKUP(B4,Table14[],3,TRUE))","v":""},null,null,null,null,null,null,null,null,null,null,null,null,null,"Bridge Replacement (US)",1000000,{"$f":"41.257*LN(B3)-445.28","v":{"$error":"#NUM!"}},"B","2017-04-01",{"$error":"#NUM!"},null,null,null,null,null,"2019-08-01"]
["Regression Completion",null,"click to get the completion date using regression equations",null,null,null,null,null,null,null,null,null,null,null,null,"Bridge Replacement (SR)",1000000,{"$f":"30.862*LN(B3)-310.53","v":{"$error":"#NUM!"}},"B","2017-04-01",{"$error":"#NUM!"},null,null,null,null,null,"2019-09-01"]
["Method","Production",null,null,null,null,null,null,null,null,null,null,null,null,null,"Bridge Replacement (CR)",1000000,{"$f":"48.795*LN(B3)-537.95","v":{"$error":"#NUM!"}},"B","2017-04-01",{"$error":"#NUM!"}]
["Work Days",{"$f":"IF(B5=0,\"\",TimeSet[[#Totals],[WORKDAYS]])","v":0},"Click to go to the Production tab to enter controlling items",null,null,null,null,null,null,null,null,null,null,null,null,"Intersection Improvement",1000000,{"$f":"18.87761*LN(B3)-189.62836","v":{"$error":"#NUM!"}},"H","2017-04-01",{"$error":"#NUM!"},null,null,null,null,null,{"$f":"DATE(YEAR(AA9),MONTH(AA9)+1,1)","v":"2019-10-01"}]
["Production Completion",{"$f":"IF(B5=0,\"\",TimeSet[[#Totals],[Start/Finish]])","v":"2019-04-11"},null,null,null,null,null,null,null,null,null,null,null,null,null,"Mill and Asphalt Resurface",1000000,{"$f":"39.895*LN(B3)-455.48","v":{"$error":"#NUM!"}},"H","2017-04-01",{"$error":"#NUM!"},null,null,null,null,null,"2019-11-01"]
[null,null,null,null,null,null,null,null,null,null,null,null,null,null,null,"New Road Construction",1000000,{"$f":"3*10^(-5)*B3+19.894","v":19.893999999999998},"H","2017-04-01","2017-04-27",null,null,null,null,null,"2019-12-01"]
[null,null,null,null,null,"  ",null,null,null,null,null,null,null,null,null,"Pavement Rehabilitation",1000000,{"$f":"1.2507*B3^0.3108","v":0},"H","2017-04-01","2017-04-01"]
[null,null,null,null,null,null,null,null,null,null,null,null,null,null,null,"Road Rehabiliation",1000000,{"$f":"0.00001675*B3+67.211","v":67.210999999999999},"H","2017-04-01","2017-07-04",null,null,null,null,null,5]
{"$rows_left_out":4}
{"sheet":"Production","index":1,"n_rows":131,"n_cols":27,"rows_kept":131,"cut":false,"hidden":false,"merged":[]}
["Seq","Construction Activity","Work Type (H,B,C)","Production Rate","QUANTITY","UNIT","CREWS / SHIFTS","WORKDAYS","Comments","Start/Finish",null,null,null,"Template","","Work Type(H,L,B)","MEAN VALUE","QUANTITY","UNIT","CREWS / SHIFTS","WORKDAYS","comments","start/finish",null,null,{"$f":"+'Time Set'!B5","v":"2019-04-01"},{"$f":"+DATE(YEAR(Z1),1,1)","v":"2019-01-01"}]
[0,"Notice to Proceed","C",1,10,"DAYS",1,{"$f":"(IF(D2=\"\",\"\",ROUNDUP((E2/D2)/G2,0)))","v":10},"Do not Delete Row; May edit Activity or Start Date","2019-04-11",null,null,null,null,null,{"$f":"IF(O2=\"\",\"\",INDEX(Production[Work Type],MATCH(O2,Production[CONSTRUCTION ACTIVITY],0)))","v":""},{"$f":"IF(O2=\"\",\"\",INDEX(Production[MEAN VALUE],MATCH(O2,Production[CONSTRUCTION ACTIVITY],0)))","v":""},null,{"$f":"IF(O2=\"\",\"\",INDEX(Production[UNIT],MATCH(O2,Production[CONSTRUCTION ACTIVITY],0)))","v":""},1,{"$f":"(IF(Q2=\"\",\"\",ROUNDUP((R2/Q2)/T2,0)))","v":""},"Enter Comments",null,null,null,null,{"$f":"+DATE(YEAR(AA1),MONTH(AA1)+1,1)","v":"2019-02-01"}]
["Total",null,null,null,null,null,null,null,"Do not Delete Row",{"$f":"SUBTOTAL(104,TimeSet[Start/Finish])","v":"2019-04-11"},null,null,null,null,null,null,null,null,null,null,null,null,null,null,null,null,{"$f":"+DATE(YEAR(AA2),MONTH(AA2)+1,1)","v":"2019-03-01"}]
[null,null,{"$f":"IF(B4=\"\",\"\",INDEX($D1:$D2,MATCH(B4,$B1:$B2,0)))","v":""},null,{"$f":"IF(B4=\"\",\"\",INDEX($C1:$C2,MATCH(B4,$B1:$B2,0)))","v":""},null,{"$f":"IF(C4=\"\",\"\",D4/C4)","v":""},null,null,null,null,null,null,null,null,null,null,null,null,null,null,null,null,null,null,null,{"$f":"+DATE(YEAR(AA3),MONTH(AA3)+1,1)","v":"2019-04-01"}]
[null,null,{"$f":"IF(B5=\"\",\"\",INDEX($D1:$D2,MATCH(B5,$B1:$B2,0)))","v":""},null,{"$f":"IF(B5=\"\",\"\",INDEX($C1:$C2,MATCH(B5,$B1:$B2,0)))","v":""},null,"",null,null,null,null,null,null,null,null,null,null,null,null,null,null,null,null,null,null,null,"2019-05-01"]
[null,null,null,null,null,null,null,null,null,null,null,null,null,null,null,null,null,null,null,null,null,null,null,null,null,null,"2019-06-01"]
[null,null,null,null,null,null,null,null,null,null,null,null,null,null,null,null,null,null,null,null,null,null,null,null,null,null,"2019-07-01"]
[null,null,null,null,null,null,null,null,null,null,null,null,null,null,null,null,null,null,null,null,null,null,null,null,null,null,"2019-08-01"]
[null,null,null,null,null,null,null,null,null,null,null,null,null,null,null,null,null,null,null,null,null,null,null,null,null,null,"2019-09-01"]
[null,null,null,null,null,null,null,null,null,null,null,null,null,null,null,null,null,null,null,null,null,null,null,null,null,null,"2019-10-01"]
[]
[]
[]
[]
[]
{"$rows_left_out":117}
{"sheet":"Med&Heavy","index":2,"n_rows":100,"n_cols":41,"rows_kept":100,"cut":false,"hidden":false,"merged":[[1,9,2,13],[3,9,3,13],[4,9,4,13]]}
[null,"2019-05-30",null,null,null,null,null,null,null,null,null,null,null,null,null,null,null,"January",null,"February",null,"March",null,"April",null,"May",null,"June",null,"July",null,"August",null,"September",null,"October",null,"November",null,"December"]
[null,null,null,{"$f":"DATE(YEAR(B1),1,1)","v":"2019-01-01"},null,null,null,null,null,"Medium & Heavy Grading (R,RS,M)",null,null,null,null,null,null,null,{"$f":"DATE(YEAR('Time Set'!$B$5),1,1)","v":"2019-01-01"},{"$f":"WEEKDAY(R2,2)","v":2},{"$f":"DATE(YEAR('Time Set'!$B$5),2,1)","v":"2019-02-01"},{"$f":"WEEKDAY(T2,2)","v":5},{"$f":"DATE(YEAR('Time Set'!$B$5),3,1)","v":"2019-03-01"},{"$f":"WEEKDAY(V2,2)","v":5},{"$f":"DATE(YEAR('Time Set'!$B$5),4,1)","v":"2019-04-01"},{"$f":"WEEKDAY(X2,2)","v":1},{"$f":"DATE(YEAR('Time Set'!$B$5),5,1)","v":"2019-05-01"},{"$f":"WEEKDAY(Z2,2)","v":3},{"$f":"DATE(YEAR('Time Set'!$B$5),6,1)","v":"2019-06-01"},{"$f":"WEEKDAY(AB2,2)","v":6},{"$f":"DATE(YEAR('Time Set'!$B$5),7,1)","v":"2019-07-01"},{"$f":"WEEKDAY(AD2,2)","v":1},{"$f":"DATE(YEAR('Time Set'!$B$5),8,1)","v":"2019-08-01"},{"$f":"WEEKDAY(AF2,2)","v":4},{"$f":"DATE(YEAR('Time Set'!$B$5),9,1)","v":"2019-09-01"},{"$f":"WEEKDAY(AH2,2)","v":7},{"$f":"DATE(YEAR('Time Set'!$B$5),10,1)","v":"2019-10-01"},{"$f":"WEEKDAY(AJ2,2)","v":2},{"$f":"DATE(YEAR('Time Set'!$B$5),11,1)","v":"2019-11-01"},{"$f":"WEEKDAY(AL2,2)","v":5},{"$f":"DATE(YEAR('Time Set'!$B$5),12,1)","v":"2019-12-01"},{"$f":"WEEKDAY(AN2,2)","v":7}]
[null,0,{"$f":"DATE(YEAR(B1),1,1)","v":"2019-01-01"},null,{"$f":"DATE(YEAR(D2),2,1)","v":"2019-02-01"},null,null,null,null,null,null,null,null,null,null,null,null,{"$f":"+R2+1","v":"2019-01-02"},{"$f":"WEEKDAY(R3,2)","v":3},{"$f":"+T2+1","v":"2019-02-02"},{"$f":"WEEKDAY(T3,2)","v":6},{"$f":"+V2+1","v":"2019-03-02"},{"$f":"WEEKDAY(V3,2)","v":6},{"$f":"+X2+1","v":"2019-04-02"},{"$f":"WEEKDAY(X3,2)","v":2},{"$f":"+Z2+1","v":"2019-05-02"},{"$f":"WEEKDAY(Z3,2)","v":4},{"$f":"+AB2+1","v":"2019-06-02"},{"$f":"WEEKDAY(AB3,2)","v":7},{"$f":"+AD2+1","v":"2019-07-02"},{"$f":"WEEKDAY(AD3,2)","v":2},{"$f":"+AF2+1","v":"2019-08-02"},{"$f":"WEEKDAY(AF3,2)","v":5},{"$f":"+AH2+1","v":"2019-09-02"},{"$f":"WEEKDAY(AH3,2)","v":1},{"$f":"+AJ2+1","v":"2019-10-02"},{"$f":"WEEKDAY(AJ3,2)","v":3},{"$f":"+AL2+1","v":"2019-11-02"},{"$f":"WEEKDAY(AL3,2)","v":6},{"$f":"+AN2+1","v":"2019-12-02"},{"$f":"WEEKDAY(AN3,2)","v":1}]
[null,0,{"$f":"DATE(YEAR(C3),MONTH(C3)+1,1)","v":"2019-02-01"},null,null,{"$f":"DATE(YEAR(D2),3,1)","v":"2019-03-01"},null,null,null,"Distribution of Working Days by",null,null,null,null,null,null,null,{"$f":"+R3+1","v":"2019-01-03"},4,{"$f":"+T3+1","v":"2019-02-03"},7,{"$f":"+V3+1","v":"2019-03-03"},7,{"$f":"+X3+1","v":"2019-04-03"},3,{"$f":"+Z3+1","v":"2019-05-03"},5,{"$f":"+AB3+1","v":"2019-06-03"},1,{"$f":"+AD3+1","v":"2019-07-03"},3,{"$f":"+AF3+1","v":"2019-08-03"},6,{"$f":"+AH3+1","v":"2019-09-03"},2,{"$f":"+AJ3+1","v":"2019-10-03"},4,{"$f":"+AL3+1","v":"2019-11-03"},7,{"$f":"+AN3+1","v":"2019-12-03"},2]
[null,0,{"$f":"DATE(YEAR(C4),MONTH(C4)+1,1)","v":"2019-03-01"},null,null,null,{"$f":"DATE(YEAR(D2),4,1)","v":"2019-04-01"},null,null,"Months, Cumulative Total per Month",null,null,null,null,null,null,null,"2019-01-04",5,"2019-02-04",1,"2019-03-04",1,"2019-04-04",4,"2019-05-04",6,"2019-06-04",2,"2019-07-04",4,"2019-08-04",7,"2019-09-04",3,"2019-10-04",5,"2019-11-04",1,"2019-12-04",3]
[4,{"$f":"+IF('Time Set'!$B$6=5,A6,IF('Time Set'!$B$6=6,A6+Y32, IF('Time Set'!$B$6=7, A6+Y32+Y33, 0)))","v":4},"2019-04-01",{"$f":"+D5+$B6","v":4},4,4,{"$f":"+B6","v":4},{"$f":"DATE(YEAR(D2),5,1)","v":"2019-05-01"},null,null,null,null,null,null,null,null,null,"2019-01-05",6,"2019-02-05",2,"2019-03-05",2,"2019-04-05",5,"2019-05-05",7,"2019-06-05",3,"2019-07-05",5,"2019-08-05",1,"2019-09-05",4,"2019-10-05",6,"2019-11-05",2,"2019-12-05",4]
[14,{"$f":"+IF('Time Set'!$B$6=5,A7,IF('Time Set'!$B$6=6,A7+AA33, IF('Time Set'!$B$6=7, A7+AA33+AA34, 0)))","v":14},"2019-05-01",18,18,18,{"$f":"+G6+$B7","v":18},{"$f":"+B7","v":14},{"$f":"DATE(YEAR(D2),6,1)","v":"2019-06-01"},null,null,null,null,null,null,null,null,"2019-01-06",7,"2019-02-06",3,"2019-03-06",3,"2019-04-06",6,"2019-05-06",1,"2019-06-06",4,"2019-07-06",6,"2019-08-06",2,"2019-09-06",5,"2019-10-06",7,"2019-11-06",3,"2019-12-06",5]
[16,{"$f":"+IF('Time Set'!$B$6=5,A8,IF('Time Set'!$B$6=6,A8+AC32, IF('Time Set'!$B$6=7, A8+AC32+AC33, 0)))","v":16},"2019-06-01",{"$f":"+D7+$B8","v":34},{"$f":"+E7+$B8","v":34},34,34,{"$f":"+H7+$B8","v":30},{"$f":"+B8","v":16},{"$f":"DATE(YEAR(D2),7,1)","v":"2019-07-01"},null,null,null,null,null,null,null,"2019-01-07",1,"2019-02-07",4,"2019-03-07",4,"2019-04-07",7,"2019-05-07",2,"2019-06-07",5,"2019-07-07",7,"2019-08-07",3,"2019-09-07",6,"2019-10-07",1,"2019-11-07",4,"2019-12-07",6]
[16,{"$f":"+IF('Time Set'!$B$6=5,A9,IF('Time Set'!$B$6=6,A9+AE33, IF('Time Set'!$B$6=7, A9+AE33+AE34, 0)))","v":16},"2019-07-01",50,50,50,50,46,32,{"$f":"+B9","v":16},{"$f":"DATE(YEAR(D2),8,1)","v":"2019-08-01"},null,null,null,null,null,null,"2019-01-08",2,"2019-02-08",5,"2019-03-08",5,"2019-04-08",1,"2019-05-08",3,"2019-06-08",6,"2019-07-08",1,"2019-08-08",4,"2019-09-08",7,"2019-10-08",2,"2019-11-08",5,"2019-12-08",7]
[18,{"$f":"+IF('Time Set'!$B$6=5,A10,IF('Time Set'!$B$6=6,A10+AG33, IF('Time Set'!$B$6=7, A10+AG33+AG34, 0)))","v":18},"2019-08-01",68,68,68,68,64,50,34,{"$f":"+B10","v":18},{"$f":"DATE(YEAR(D2),9,1)","v":"2019-09-01"},null,null,null,null,null,"2019-01-09",3,"2019-02-09",6,"2019-03-09",6,"2019-04-09",2,"2019-05-09",4,"2019-06-09",7,"2019-07-09",2,"2019-08-09",5,"2019-09-09",1,"2019-10-09",3,"2019-11-09",6,"2019-12-09",1]
[15,{"$f":"+IF('Time Set'!$B$6=5,A11,IF('Time Set'!$B$6=6,A11+AI32, IF('Time Set'!$B$6=7, A11+AI32+AI33, 0)))","v":15},"2019-09-01",83,83,83,83,79,65,49,33,{"$f":"+B11","v":15},{"$f":"DATE(YEAR(D2),10,1)","v":"2019-10-01"},null,null,null,null,"2019-01-10",4,"2019-02-10",7,"2019-03-10",7,"2019-04-10",3,"2019-05-10",5,"2019-06-10",1,"2019-07-10",3,"2019-08-10",6,"2019-09-10",2,"2019-10-10",4,"2019-11-10",7,"2019-12-10",2]
[16,{"$f":"+IF('Time Set'!$B$6=5,A12,IF('Time Set'!$B$6=6,A12+AK33, IF('Time Set'!$B$6=7, A12+AK33+AK34,0)))","v":16},"2019-10-01",99,99,99,99,95,81,65,49,31,{"$f":"+B12","v":16},{"$f":"DATE(YEAR(D2),11,1)","v":"2019-11-01"},null,null,null,"2019-01-11",5,"2019-02-11",1,"2019-03-11",1,"2019-04-11",4,"2019-05-11",6,"2019-06-11",2,"2019-07-11",4,"2019-08-11",7,"2019-09-11",3,"2019-10-11",5,"2019-11-11",1,"2019-12-11",3]
[8,{"$f":"+IF('Time Set'!$B$6=5,A13,IF('Time Set'!$B$6=6,A13+AM32, IF('Time Set'!$B$6=7, A13+AM32+AM33, 0)))","v":8},"2019-11-01",107,107,107,107,103,89,73,57,39,24,{"$f":"+B13","v":8},{"$f":"DATE(YEAR(D2),12,1)","v":"2019-12-01"},null,null,"2019-01-12",6,"2019-02-12",2,"2019-03-12",2,"2019-04-12",5,"2019-05-12",7,"2019-06-12",3,"2019-07-12",5,"2019-08-12",1,"2019-09-12",4,"2019-10-12",6,"2019-11-12",2,"2019-12-12",4]
[null,0,"2019-12-01",107,{"$f":"+E13+$B14","v":107},107,107,103,89,73,57,39,24,8,{"$f":"+B14","v":0},null,null,"2019-01-13",7,"2019-02-13",3,"2019-03-13",3,"2019-04-13",6,"2019-05-13",1,"2019-06-13",4,"2019-07-13",6,"2019-08-13",2,"2019-09-13",5,"2019-10-13",7,"2019-11-13",3,"2019-12-13",5]
[null,0,"2020-01-01",107,107,107,107,103,89,73,57,39,24,8,{"$f":"+O14+$B15","v":0},null,null,"2019-01-14",1,"2019-02-14",4,"2019-03-14",4,"2019-04-14",7,"2019-05-14",2,"2019-06-14",5,"2019-07-14",7,"2019-08-14",3,"2019-09-14",6,"2019-10-14",1,"2019-11-14",4,"2019-12-14",6]
{"$rows_left_out":86}
{"sheet":"Bridge","index":3,"n_rows":100,"n_cols":41,"rows_kept":100,"cut":false,"hidden":false,"merged":[[1,10,2,12],[3,9,3,13],[4,9,4,13]]}
[null,"2019-04-11",null,null,null,null,null,null,null,null,null,null,null,null,null,null,null,"January",null,"February",null,"March",null,"April",null,"May",null,"June",null,"July",null,"August",null,"September",null,"October",null,"November",null,"December"]
[null,null,null,{"$f":"DATE(YEAR(B1),1,1)","v":"2019-01-01"},null,null,null,null,null,null,"Bridge & Traffic (B,T)",null,null,null,null,null,null,{"$f":"DATE(YEAR('Time Set'!$B$5),1,1)","v":"2019-01-01"},{"$f":"WEEKDAY(R2,2)","v":2},{"$f":"DATE(YEAR('Time Set'!$B$5),2,1)","v":"2019-02-01"},{"$f":"WEEKDAY(T2,2)","v":5},{"$f":"DATE(YEAR('Time Set'!$B$5),3,1)","v":"2019-03-01"},{"$f":"WEEKDAY(V2,2)","v":5},{"$f":"DATE(YEAR('Time Set'!$B$5),4,1)","v":"2019-04-01"},{"$f":"WEEKDAY(X2,2)","v":1},{"$f":"DATE(YEAR('Time Set'!$B$5),5,1)","v":"2019-05-01"},{"$f":"WEEKDAY(Z2,2)","v":3},{"$f":"DATE(YEAR('Time Set'!$B$5),6,1)","v":"2019-06-01"},{"$f":"WEEKDAY(AB2,2)","v":6},{"$f":"DATE(YEAR('Time Set'!$B$5),7,1)","v":"2019-07-01"},{"$f":"WEEKDAY(AD2,2)","v":1},{"$f":"DATE(YEAR('Time Set'!$B$5),8,1)","v":"2019-08-01"},{"$f":"WEEKDAY(AF2,2)","v":4},{"$f":"DATE(YEAR('Time Set'!$B$5),9,1)","v":"2019-09-01"},{"$f":"WEEKDAY(AH2,2)","v":7},{"$f":"DATE(YEAR('Time Set'!$B$5),10,1)","v":"2019-10-01"},{"$f":"WEEKDAY(AJ2,2)","v":2},{"$f":"DATE(YEAR('Time Set'!$B$5),11,1)","v":"2019-11-01"},{"$f":"WEEKDAY(AL2,2)","v":5},{"$f":"DATE(YEAR('Time Set'!$B$5),12,1)","v":"2019-12-01"},{"$f":"WEEKDAY(AN2,2)","v":7}]
[null,0,{"$f":"DATE(YEAR(B1),1,1)","v":"2019-01-01"},null,{"$f":"DATE(YEAR(D2),2,1)","v":"2019-02-01"},null,null,null,null,null,null,null,null,null,null,null,null,{"$f":"+R2+1","v":"2019-01-02"},{"$f":"WEEKDAY(R3,2)","v":3},{"$f":"+T2+1","v":"2019-02-02"},{"$f":"WEEKDAY(T3,2)","v":6},{"$f":"+V2+1","v":"2019-03-02"},{"$f":"WEEKDAY(V3,2)","v":6},{"$f":"+X2+1","v":"2019-04-02"},{"$f":"WEEKDAY(X3,2)","v":2},{"$f":"+Z2+1","v":"2019-05-02"},{"$f":"WEEKDAY(Z3,2)","v":4},{"$f":"+AB2+1","v":"2019-06-02"},{"$f":"WEEKDAY(AB3,2)","v":7},{"$f":"+AD2+1","v":"2019-07-02"},{"$f":"WEEKDAY(AD3,2)","v":2},{"$f":"+AF2+1","v":"2019-08-02"},{"$f":"WEEKDAY(AF3,2)","v":5},{"$f":"+AH2+1","v":"2019-09-02"},{"$f":"WEEKDAY(AH3,2)","v":1},{"$f":"+AJ2+1","v":"2019-10-02"},{"$f":"WEEKDAY(AJ3,2)","v":3},{"$f":"+AL2+1","v":"2019-11-02"},{"$f":"WEEKDAY(AL3,2)","v":6},{"$f":"+AN2+1","v":"2019-12-02"},{"$f":"WEEKDAY(AN3,2)","v":1}]
[null,0,{"$f":"DATE(YEAR(C3),MONTH(C3)+1,1)","v":"2019-02-01"},null,null,{"$f":"DATE(YEAR(D2),3,1)","v":"2019-03-01"},null,null,null,"Distribution of Working Days by",null,null,null,null,null,null,null,{"$f":"+R3+1","v":"2019-01-03"},4,{"$f":"+T3+1","v":"2019-02-03"},7,{"$f":"+V3+1","v":"2019-03-03"},7,{"$f":"+X3+1","v":"2019-04-03"},3,{"$f":"+Z3+1","v":"2019-05-03"},5,{"$f":"+AB3+1","v":"2019-06-03"},1,{"$f":"+AD3+1","v":"2019-07-03"},3,{"$f":"+AF3+1","v":"2019-08-03"},6,{"$f":"+AH3+1","v":"2019-09-03"},2,{"$f":"+AJ3+1","v":"2019-10-03"},4,{"$f":"+AL3+1","v":"2019-11-03"},7,{"$f":"+AN3+1","v":"2019-12-03"},2]
[null,0,{"$f":"DATE(YEAR(C4),MONTH(C4)+1,1)","v":"2019-03-01"},null,null,null,{"$f":"DATE(YEAR(D2),4,1)","v":"2019-04-01"},null,null,"Months, Cumulative Total per Month",null,null,null,null,null,null,null,"2019-01-04",5,"2019-02-04",1,"2019-03-04",1,"2019-04-04",4,"2019-05-04",6,"2019-06-04",2,"2019-07-04",4,"2019-08-04",7,"2019-09-04",3,"2019-10-04",5,"2019-11-04",1,"2019-12-04",3]
[14,{"$f":"+IF('Time Set'!$B$6=5,A6,IF('Time Set'!$B$6=6,A6+Y32, IF('Time Set'!$B$6=7, A6+Y32+Y33, 0)))","v":14},"2019-04-01",{"$f":"+D5+$B6","v":14},{"$f":"+E5+$B6","v":14},{"$f":"+F5+$B6","v":14},{"$f":"+B6","v":14},{"$f":"DATE(YEAR(D2),5,1)","v":"2019-05-01"},null,null,null,null,null,null,null,null,null,"2019-01-05",6,"2019-02-05",2,"2019-03-05",2,"2019-04-05",5,"2019-05-05",7,"2019-06-05",3,"2019-07-05",5,"2019-08-05",1,"2019-09-05",4,"2019-10-05",6,"2019-11-05",2,"2019-12-05",4]
[17,{"$f":"+IF('Time Set'!$B$6=5,A7,IF('Time Set'!$B$6=6,A7+AA33, IF('Time Set'!$B$6=7, A7+AA33+AA34, 0)))","v":17},"2019-05-01",{"$f":"+D6+$B7","v":31},{"$f":"+E6+$B7","v":31},31,31,{"$f":"+B7","v":17},{"$f":"DATE(YEAR(D2),6,1)","v":"2019-06-01"},null,null,null,null,null,null,null,null,"2019-01-06",7,"2019-02-06",3,"2019-03-06",3,"2019-04-06",6,"2019-05-06",1,"2019-06-06",4,"2019-07-06",6,"2019-08-06",2,"2019-09-06",5,"2019-10-06",7,"2019-11-06",3,"2019-12-06",5]
[18,{"$f":"+IF('Time Set'!$B$6=5,A8,IF('Time Set'!$B$6=6,A8+AC32, IF('Time Set'!$B$6=7, A8+AC32+AC33, 0)))","v":18},"2019-06-01",49,49,49,49,{"$f":"+H7+$B8","v":35},{"$f":"+B8","v":18},{"$f":"DATE(YEAR(D2),7,1)","v":"2019-07-01"},null,null,null,null,null,null,null,"2019-01-07",1,"2019-02-07",4,"2019-03-07",4,"2019-04-07",7,"2019-05-07",2,"2019-06-07",5,"2019-07-07",7,"2019-08-07",3,"2019-09-07",6,"2019-10-07",1,"2019-11-07",4,"2019-12-07",6]
[19,{"$f":"+IF('Time Set'!$B$6=5,A9,IF('Time Set'!$B$6=6,A9+AE33, IF('Time Set'!$B$6=7, A9+AE33+AE34, 0)))","v":19},"2019-07-01",68,{"$f":"+E8+$B9","v":68},68,68,54,37,{"$f":"+B9","v":19},{"$f":"DATE(YEAR(D2),8,1)","v":"2019-08-01"},null,null,null,null,null,null,"2019-01-08",2,"2019-02-08",5,"2019-03-08",5,"2019-04-08",1,"2019-05-08",3,"2019-06-08",6,"2019-07-08",1,"2019-08-08",4,"2019-09-08",7,"2019-10-08",2,"2019-11-08",5,"2019-12-08",7]
[19,{"$f":"+IF('Time Set'!$B$6=5,A10,IF('Time Set'!$B$6=6,A10+AG33, IF('Time Set'!$B$6=7, A10+AG33+AG34, 0)))","v":19},"2019-08-01",87,87,87,87,73,56,38,{"$f":"+B10","v":19},{"$f":"DATE(YEAR(D2),9,1)","v":"2019-09-01"},null,null,null,null,null,"2019-01-09",3,"2019-02-09",6,"2019-03-09",6,"2019-04-09",2,"2019-05-09",4,"2019-06-09",7,"2019-07-09",2,"2019-08-09",5,"2019-09-09",1,"2019-10-09",3,"2019-11-09",6,"2019-12-09",1]
[16,{"$f":"+IF('Time Set'!$B$6=5,A11,IF('Time Set'!$B$6=6,A11+AI32, IF('Time Set'!$B$6=7, A11+AI32+AI33, 0)))","v":16},"2019-09-01",103,103,103,103,89,72,54,35,{"$f":"+B11","v":16},{"$f":"DATE(YEAR(D2),10,1)","v":"2019-10-01"},null,null,null,null,"2019-01-10",4,"2019-02-10",7,"2019-03-10",7,"2019-04-10",3,"2019-05-10",5,"2019-06-10",1,"2019-07-10",3,"2019-08-10",6,"2019-09-10",2,"2019-10-10",4,"2019-11-10",7,"2019-12-10",2]
[17,{"$f":"+IF('Time Set'!$B$6=5,A12,IF('Time Set'!$B$6=6,A12+AK33, IF('Time Set'!$B$6=7, A12+AK33+AK34,0)))","v":17},"2019-10-01",120,120,120,120,106,89,71,52,33,{"$f":"+B12","v":17},{"$f":"DATE(YEAR(D2),11,1)","v":"2019-11-01"},null,null,null,"2019-01-11",5,"2019-02-11",1,"2019-03-11",1,"2019-04-11",4,"2019-05-11",6,"2019-06-11",2,"2019-07-11",4,"2019-08-11",7,"2019-09-11",3,"2019-10-11",5,"2019-11-11",1,"2019-12-11",3]
[15,{"$f":"+IF('Time Set'!$B$6=5,A13,IF('Time Set'!$B$6=6,A13+AM32, IF('Time Set'!$B$6=7, A13+AM32+AM33, 0)))","v":15},"2019-11-01",135,135,135,135,121,104,86,67,48,32,{"$f":"+B13","v":15},{"$f":"DATE(YEAR(D2),12,1)","v":"2019-12-01"},null,null,"2019-01-12",6,"2019-02-12",2,"2019-03-12",2,"2019-04-12",5,"2019-05-12",7,"2019-06-12",3,"2019-07-12",5,"2019-08-12",1,"2019-09-12",4,"2019-10-12",6,"2019-11-12",2,"2019-12-12",4]
[null,0,"2019-12-01",135,{"$f":"+E13+$B14","v":135},135,135,121,104,86,67,48,32,{"$f":"+N13+B14","v":15},0,null,null,"2019-01-13",7,"2019-02-13",3,"2019-03-13",3,"2019-04-13",6,"2019-05-13",1,"2019-06-13",4,"2019-07-13",6,"2019-08-13",2,"2019-09-13",5,"2019-10-13",7,"2019-11-13",3,"2019-12-13",5]
[null,0,"2020-01-01",135,135,135,135,121,104,86,67,48,32,{"$f":"+N14+B15","v":15},0,null,null,"2019-01-14",1,"2019-02-14",4,"2019-03-14",4,"2019-04-14",7,"2019-05-14",2,"2019-06-14",5,"2019-07-14",7,"2019-08-14",3,"2019-09-14",6,"2019-10-14",1,"2019-11-14",4,"2019-12-14",6]
{"$rows_left_out":86}
{"sheet":"#Mean Rates#","index":4,"n_rows":111,"n_cols":5,"rows_kept":111,"cut":false,"hidden":false,"merged":[[0,0,0,4]]}
["ALL"]
["CONSTRUCTION ACTIVITY","Work Type","UNIT","MEAN VALUE","STANDARD DEVIATION"]
["Aggregate shoulder","H","TON",840,102]
["Backfill, Rock","B","TON",580,50]
["Barrier Delineator","B","EACH",20,2]
["Barrier Wall","B","TON",200,12]
["Beam Erection-Precast","B","LFT",400,38]
["Beam Erection-Steel","B","LFT",150,12]
["Bent Cofferdams","B","SYS",300,35]
["Box Culverts","H","LFT",50,1]
["Bridge Deck Overlay","B","SYS",360,140]
["Bridge Handrails","B","LFT",230,21]
["Bridge Rail","B","LFT",600,86]
["Chain Link Fence","B","LFT",1330,225]
["Common (Excavation)","H","CYS",990,394]
{"$rows_left_out":96}